Target
MAP kinase-interacting serine/threonine-protein kinase 2
Ligand
BDBM50379076
Substrate
Meas. Tech.
ChEMBL_809673 (CHEMBL2015892)
IC50
>10000±n/a nM
Citation
 Xu, JChen, AGo, MLNacro, KLiu, BChai, CL Exploring aigialomycin d and its analogues as protein kinase inhibitors for cancer targets. ACS Med Chem Lett 2:662-666 (2011)  
Target
Name:
MAP kinase-interacting serine/threonine-protein kinase 2
Synonyms:
GPRK7 MAP kinase-interacting serine/threonine-protein kinase 2 (MKNK2) MAP-kinase interacting kinase 2 (MNK2) MKNK2_HUMAN | MNK2
Type:
Protein
Mol. Mass.:
51870.79
Organism:
Homo sapiens (Human)
Description:
Q9HBH9
Residue:
465
  
Inhibitor
Name:
BDBM50379076
Synonyms:
CHEMBL2012391
Type:
Small organic molecule
Emp. Form.:
C18H26O6
Mol. Mass.:
338.3954
SMILES:
C[C@H]1CCC[C@@H](O)[C@@H](O)CCCCc2cc(O)cc(O)c2C(=O)O1
: