Target
Histone deacetylase 3/Nuclear receptor corepressor 2 (HDAC3/NCoR2)
Ligand
BDBM50379131
Substrate
Meas. Tech.
ChEMBL_809834 (CHEMBL2014771)
IC50
32±n/a nM
Citation
 Hutt, DMOlsen, CAVickers, CJHerman, DChalfant, MMontero, ALeman, LJBurkle, RMaryanoff, BEBalch, WEGhadiri, MR Potential Agents for Treating Cystic Fibrosis: Cyclic Tetrapeptides that Restore Trafficking and Activity of ¿F508-CFTR. ACS Med Chem Lett 2:703-707 (2011)  
Target
Name:
Histone deacetylase 3/Nuclear receptor corepressor 2 (HDAC3/NCoR2)
Synonyms:
HDAC3/NcoR2 Complex | Histone deacetylase 3/Nuclear receptor corepressor 2
Type:
Mol. Mass.:
Description:
ASSAY_ID of ChEMBL is 2146499
Components:
This complex has 2 components.
Component 1
Name:
Histone deacetylase 3
Synonyms:
HD3 HDAC3_HUMAN Human HDAC3 SMAP45
Type:
Enzyme
Mol. Mass.:
48829.55
Organism:
Homo sapiens (Human)
Description:
O15379
Residue:
428
  
Component 2
Name:
Nuclear receptor corepressor 2
Synonyms:
CTG repeat protein 26 Histone deacetylase 2/Nuclear receptor corepressor 2 NCOR2 Nuclear receptor corepressor 2 SMAP270 Silencing mediator of retinoic acid and thyroid hormone receptor TRAC | Thyroid-, retinoic-acid-receptor-associated corepressor
Type:
Enzyme
Mol. Mass.:
274839.59
Organism:
Homo sapiens (Human)
Description:
Q9Y618
Residue:
2514
  
Inhibitor
Name:
BDBM50379131
Synonyms:
CHEMBL2012815
Type:
Small organic molecule
Emp. Form.:
C33H46N4O5
Mol. Mass.:
578.7421
SMILES:
CCC(=O)CCCCC[C@@H]1NC(=O)[C@H](C)NC(=O)C[C@H](CC(C)C)NC(=O)[C@H](Cc2cccc3ccccc23)NC1=O
: