Target
Potassium voltage-gated channel subfamily H member 2
Ligand
BDBM50379159
Substrate
Meas. Tech.
ChEMBL_810399 (CHEMBL2014817)
IC50
7000±n/a nM
Citation
 Brocklehurst, KJBroo, AButlin, RJBrown, HSClarke, DSDavidsson, ÖGoldberg, KGroombridge, SDKelly, EELeach, AMcKerrecher, DO'Donnell, CPoucher, SSchofield, PScott, JSTeague, JWestgate, LWood, MJ Discovery, optimisation and in vivo evaluation of novel GPR119 agonists. Bioorg Med Chem Lett 21:7310-6 (2011)  
Target
Name:
Potassium voltage-gated channel subfamily H member 2
Synonyms:
1,3-beta-glucan synthase component GLS2 ERG Eag-related protein 1 Ether-a-go-go-related gene (HERG) Ether-a-go-go-related gene potassium channel 1 Ether-a-go-go-related gene potassium channel 1 (hERG1) Ether-a-go-go-related protein 1 H-ERG KCNH2 Potassium voltage-gated channel subfamily H member 2 (hERG) Voltage-gated potassium channel subunit Kv11.1 hERG Potassium Channel 1 | putative potassium channel subunit
Type:
Multi-pass membrane protein
Mol. Mass.:
126672.65
Organism:
Homo sapiens (Human)
Description:
Q12809
Residue:
1159
  
Inhibitor
Name:
BDBM50379159
Synonyms:
CHEMBL2010853
Type:
Small organic molecule
Emp. Form.:
C23H25F2N3O3S2
Mol. Mass.:
493.59
SMILES:
CN([C@@H]1CCN(Cc2nc3cc(F)ccc3s2)C[C@@H]1F)C(=O)Cc1ccc(cc1)S(C)(=O)=O
: