Target
Vascular endothelial growth factor receptor 2
Ligand
BDBM50379216
Substrate
Meas. Tech.
ChEMBL_811221 (CHEMBL2015056)
IC50
2600±n/a nM
Citation
 Abu Thaher, BArnsmann, MTotzke, FEhlert, JEKubbutat, MHSchächtele, CZimmermann, MOKoch, PBoeckler, FMLaufer, SA Tri- and tetrasubstituted pyrazole derivates: regioisomerism switches activity from p38MAP kinase to important cancer kinases. J Med Chem 55:961-5 (2012)  
Target
Name:
Vascular endothelial growth factor receptor 2
Synonyms:
CD_antigen=CD309 Fetal liver kinase 1 (FLK-1) KDR Protein-tyrosine kinase receptor Flk-1 VEGFR-2 VEGFR2 Vascular Endothelial Growth Factor Receptor Kinase 2 Vascular endothelial growth factor receptor 2 (KDR) Vascular endothelial growth factor receptor 2 (VEGFR2) Vascular endothelial growth factor receptor-2 (VEGFR-2)
Type:
Receptor Tyrosine Kinase
Mol. Mass.:
151510.97
Organism:
Homo sapiens (Human)
Description:
P35968
Residue:
1356
  
Inhibitor
Name:
BDBM50379216
Synonyms:
CHEMBL2011296 | US9416123, 10
Type:
Small organic molecule
Emp. Form.:
C21H17FN4
Mol. Mass.:
344.3849
SMILES:
Cc1ccc(cc1)-n1nc(c(c1N)-c1ccc(F)cc1)-c1ccncc1
: