Target
Proto-oncogene tyrosine-protein kinase Src
Ligand
BDBM50379218
Substrate
Meas. Tech.
ChEMBL_811222 (CHEMBL2015057)
IC50
2000±n/a nM
Citation
 Abu Thaher, BArnsmann, MTotzke, FEhlert, JEKubbutat, MHSchächtele, CZimmermann, MOKoch, PBoeckler, FMLaufer, SA Tri- and tetrasubstituted pyrazole derivates: regioisomerism switches activity from p38MAP kinase to important cancer kinases. J Med Chem 55:961-5 (2012)  
Target
Name:
Proto-oncogene tyrosine-protein kinase Src
Synonyms:
Calmodulin/Proto-oncogene tyrosine-protein kinase Src Proto-oncogene c-Src SRC SRC_HUMAN V-src sarcoma (Schmidt-Ruppin A-2) viral oncogene homolog (avian) p60-Src | pp60c-src
Type:
Protein
Mol. Mass.:
59838.60
Organism:
Homo sapiens (Human)
Description:
P12931
Residue:
536
  
Inhibitor
Name:
BDBM50379218
Synonyms:
CHEMBL2011304
Type:
Small organic molecule
Emp. Form.:
C20H11Cl3FN3
Mol. Mass.:
418.679
SMILES:
Fc1ccc(cc1)-c1cn(nc1-c1ccncc1)-c1c(Cl)cc(Cl)cc1Cl
: