Target
Proto-oncogene tyrosine-protein kinase Src
Ligand
BDBM50379226
Substrate
Meas. Tech.
ChEMBL_811222 (CHEMBL2015057)
IC50
23000±n/a nM
Citation
 Abu Thaher, BArnsmann, MTotzke, FEhlert, JEKubbutat, MHSchächtele, CZimmermann, MOKoch, PBoeckler, FMLaufer, SA Tri- and tetrasubstituted pyrazole derivates: regioisomerism switches activity from p38MAP kinase to important cancer kinases. J Med Chem 55:961-5 (2012)  
Target
Name:
Proto-oncogene tyrosine-protein kinase Src
Synonyms:
Calmodulin/Proto-oncogene tyrosine-protein kinase Src Proto-oncogene c-Src SRC SRC_HUMAN V-src sarcoma (Schmidt-Ruppin A-2) viral oncogene homolog (avian) p60-Src | pp60c-src
Type:
Protein
Mol. Mass.:
59838.60
Organism:
Homo sapiens (Human)
Description:
P12931
Residue:
536
  
Inhibitor
Name:
BDBM50379226
Synonyms:
CHEMBL2011294 | US9416123, 8
Type:
Small organic molecule
Emp. Form.:
C21H17FN4O
Mol. Mass.:
360.3843
SMILES:
COc1ccc(cc1)-n1nc(c(c1N)-c1ccc(F)cc1)-c1ccncc1
: