Target
Vascular endothelial growth factor receptor 2
Ligand
BDBM50379223
Substrate
Meas. Tech.
ChEMBL_811221 (CHEMBL2015056)
IC50
2400±n/a nM
Citation
 Abu Thaher, BArnsmann, MTotzke, FEhlert, JEKubbutat, MHSchächtele, CZimmermann, MOKoch, PBoeckler, FMLaufer, SA Tri- and tetrasubstituted pyrazole derivates: regioisomerism switches activity from p38MAP kinase to important cancer kinases. J Med Chem 55:961-5 (2012)  
Target
Name:
Vascular endothelial growth factor receptor 2
Synonyms:
CD_antigen=CD309 Fetal liver kinase 1 (FLK-1) KDR Protein-tyrosine kinase receptor Flk-1 VEGFR-2 VEGFR2 Vascular Endothelial Growth Factor Receptor Kinase 2 Vascular endothelial growth factor receptor 2 (KDR) Vascular endothelial growth factor receptor 2 (VEGFR2) Vascular endothelial growth factor receptor-2 (VEGFR-2)
Type:
Receptor Tyrosine Kinase
Mol. Mass.:
151510.97
Organism:
Homo sapiens (Human)
Description:
P35968
Residue:
1356
  
Inhibitor
Name:
BDBM50379223
Synonyms:
CHEMBL2011298 | US9416123, 12
Type:
Small organic molecule
Emp. Form.:
C21H14F4N4
Mol. Mass.:
398.3563
SMILES:
Nc1c(c(nn1-c1ccc(cc1)C(F)(F)F)-c1ccncc1)-c1ccc(F)cc1
: