Target
Monoglyceride lipase
Ligand
BDBM50379251
Substrate
Meas. Tech.
ChEMBL_811231 (CHEMBL2015066)
IC50
870.96±n/a nM
Citation
 Cisneros, JABjörklund, EGonzález-Gil, IHu, YCanales, AMedrano, FJRomero, AOrtega-Gutiérrez, SFowler, CJLópez-Rodríguez, ML Structure-activity relationship of a new series of reversible dual monoacylglycerol lipase/fatty acid amide hydrolase inhibitors. J Med Chem 55:824-36 (2012)  
Target
Name:
Monoglyceride lipase
Synonyms:
MAGL Mgl2 Monoacylglycerol lipase Monoglyceride lipase (MGL)
Type:
Enzyme
Mol. Mass.:
33505.38
Organism:
Rattus norvegicus (Rat)
Description:
Q8R431
Residue:
303
  
Inhibitor
Name:
BDBM50379251
Synonyms:
CHEMBL2011308
Type:
Small organic molecule
Emp. Form.:
C18H18O3
Mol. Mass.:
282.3337
SMILES:
O=C(CCc1ccc(cc1)-c1ccccc1)OCC1CO1
: