Target
Sodium channel protein type 5 subunit alpha
Ligand
BDBM50379439
Substrate
Meas. Tech.
ChEMBL_812133 (CHEMBL2013637)
IC50
190±n/a nM
Citation
 Chakka, NBregman, HDu, BNguyen, HNBuchanan, JLFeric, ELigutti, JLiu, DMcDermott, JSZou, AMcDonough, SIDimauro, EF Discovery and hit-to-lead optimization of pyrrolopyrimidines as potent, state-dependent Na(v)1.7 antagonists. Bioorg Med Chem Lett 22:2052-62 (2012)  
Target
Name:
Sodium channel protein type 5 subunit alpha
Synonyms:
HH1 SCN5A_HUMAN Sodium channel protein type 5 subunit alpha/beta-1/beta-2 Voltage-gated sodium channel subunit alpha Nav1.5
Type:
Enzyme
Mol. Mass.:
226908.60
Organism:
Homo sapiens (Human)
Description:
Q14524
Residue:
2016
  
Inhibitor
Name:
BDBM50379439
Synonyms:
CHEMBL2012301
Type:
Small organic molecule
Emp. Form.:
C25H23F4N5O
Mol. Mass.:
485.4766
SMILES:
Fc1c(Cn2ccc3c(OC4CCN(Cc5ccccn5)CC4)ncnc23)cccc1C(F)(F)F
: