Target
Serine/threonine-protein kinase haspin
Ligand
BDBM50379514
Substrate
Meas. Tech.
ChEMBL_812377 (CHEMBL2014113)
IC50
2700±n/a nM
Citation
 Cuny, GDUlyanova, NPPatnaik, DLiu, JFLin, XAuerbach, KRay, SSXian, JGlicksman, MAStein, RLHiggins, JM Structure-activity relationship study of beta-carboline derivatives as haspin kinase inhibitors. Bioorg Med Chem Lett 22:2015-9 (2012)  
Target
Name:
Serine/threonine-protein kinase haspin
Synonyms:
GSG2 H-haspin HASP_HUMAN | Haploid germ cell-specific nuclear protein kinase
Type:
PROTEIN
Mol. Mass.:
88531.28
Organism:
Homo sapiens (Human)
Description:
ChEMBL_1510616
Residue:
798
  
Inhibitor
Name:
BDBM50379514
Synonyms:
CHEMBL2012567
Type:
Small organic molecule
Emp. Form.:
C17H21N3O
Mol. Mass.:
283.3681
SMILES:
COc1cccc2n(CCCCN)c3c(C)nccc3c12
: