Target
Serine/threonine-protein kinase Chk1
Ligand
BDBM50379623
Substrate
Meas. Tech.
ChEMBL_811848 (CHEMBL2014579)
IC50
19±n/a nM
Citation
 Dudkin, VYWang, CArrington, KLFraley, MEHartman, GDStirdivant, SMDrakas, RARickert, KWalsh, ESHamilton, KBuser, CAHardwick, JTao, WBeck, SCMao, XLobell, RBSepp-Lorenzino, L Pyridyl aminothiazoles as potent Chk1 inhibitors: optimization of cellular activity. Bioorg Med Chem Lett 22:2613-9 (2012)  
Target
Name:
Serine/threonine-protein kinase Chk1
Synonyms:
CHEK1 CHK1 checkpoint homolog Checkpoint kinase-1 (CHK1)
Type:
Enzyme Catalytic Domain
Mol. Mass.:
54443.02
Organism:
Homo sapiens (Human)
Description:
gi_166295192
Residue:
476
  
Inhibitor
Name:
BDBM50379623
Synonyms:
CHEMBL2011344
Type:
Small organic molecule
Emp. Form.:
C22H20N6OS
Mol. Mass.:
416.499
SMILES:
C1CN(CCO1)c1ccnc(Nc2ncc(s2)-c2cncc(c2)-c2cccnc2)c1
: