Target
Cyclin-dependent kinase 7
Ligand
BDBM50379628
Substrate
Meas. Tech.
ChEMBL_811849 (CHEMBL2014580)
IC50
>20000±n/a nM
Citation
 Dudkin, VYWang, CArrington, KLFraley, MEHartman, GDStirdivant, SMDrakas, RARickert, KWalsh, ESHamilton, KBuser, CAHardwick, JTao, WBeck, SCMao, XLobell, RBSepp-Lorenzino, L Pyridyl aminothiazoles as potent Chk1 inhibitors: optimization of cellular activity. Bioorg Med Chem Lett 22:2613-9 (2012)  
Target
Name:
Cyclin-dependent kinase 7
Synonyms:
39 kDa protein kinase CAK1 CDK-activating kinase 1 (CAK) CDK7_HUMAN Cell division protein kinase 7 Cyclin-dependent kinase 7 (CDK7/cyclin H) P39 Mo15 TFIIH basal transcription factor complex kinase subunit
Type:
Enzyme Subunit
Mol. Mass.:
39047.01
Organism:
Homo sapiens (Human)
Description:
Residue:
346
  
Inhibitor
Name:
BDBM50379628
Synonyms:
CHEMBL2011330
Type:
Small organic molecule
Emp. Form.:
C18H20N6S
Mol. Mass.:
352.457
SMILES:
Cc1ccc(cn1)-c1cnc(Nc2cc(ccn2)N2CCNCC2)s1
: