Target
Cyclin-dependent kinase 7
Ligand
BDBM50379645
Substrate
Meas. Tech.
ChEMBL_811849 (CHEMBL2014580)
IC50
910±n/a nM
Citation
 Dudkin, VYWang, CArrington, KLFraley, MEHartman, GDStirdivant, SMDrakas, RARickert, KWalsh, ESHamilton, KBuser, CAHardwick, JTao, WBeck, SCMao, XLobell, RBSepp-Lorenzino, L Pyridyl aminothiazoles as potent Chk1 inhibitors: optimization of cellular activity. Bioorg Med Chem Lett 22:2613-9 (2012)  
Target
Name:
Cyclin-dependent kinase 7
Synonyms:
39 kDa protein kinase CAK1 CDK-activating kinase 1 (CAK) CDK7_HUMAN Cell division protein kinase 7 Cyclin-dependent kinase 7 (CDK7/cyclin H) P39 Mo15 TFIIH basal transcription factor complex kinase subunit
Type:
Enzyme Subunit
Mol. Mass.:
39047.01
Organism:
Homo sapiens (Human)
Description:
Residue:
346
  
Inhibitor
Name:
BDBM50379645
Synonyms:
CHEMBL2013162
Type:
Small organic molecule
Emp. Form.:
C17H18N6OS
Mol. Mass.:
354.429
SMILES:
Cc1cccnc1Nc1ncc(s1)-c1cncc(c1)C(=O)NCCN
: