Target
Cannabinoid receptor 2
Ligand
BDBM50379693
Substrate
Meas. Tech.
ChEMBL_812056 (CHEMBL2013482)
IC50
1±n/a nM
Citation
 Nelson, DWFrost, JMTietje, KRFlorjancic, ASRyther, KCarroll, WADart, MJDaza, AVHooker, BAGrayson, GKFan, YGarrison, TREl-Kouhen, OFYao, BPai, MChandran, PZhu, CHsieh, GCMeyer, MD Synthesis and evaluation of 2-amido-3-carboxamide thiophene CB2 receptor agonists for pain management. Bioorg Med Chem Lett 22:2604-8 (2012)  
Target
Name:
Cannabinoid receptor 2
Synonyms:
CANNABINOID CB2 CB2 CB2B CNR2_HUMAN Cannabinoid CB2 receptor Cannabinoid receptor 2 (CB2R) | hCB2
Type:
G Protein-Coupled Receptor (GPCR)
Mol. Mass.:
39690.94
Organism:
Homo sapiens (Human)
Description:
P34972
Residue:
360
  
Inhibitor
Name:
BDBM50379693
Synonyms:
CHEMBL2010905
Type:
Small organic molecule
Emp. Form.:
C19H28N2O3S
Mol. Mass.:
364.502
SMILES:
CCCNC(=O)c1c(NC(=O)C2C(C)(C)C2(C)C)sc2COCCc12
: