Target
Peroxisome proliferator-activated receptor alpha
Ligand
BDBM50379791
Substrate
Meas. Tech.
ChEMBL_812493 (CHEMBL2014329)
EC50
46500±n/a nM
Citation
 Quang, THNgan, NTMinh, CVKiem, PVTai, BHThao, NPSong, SBKim, YH Anti-inflammatory and PPAR transactivational effects of secondary metabolites from the roots of Asarum sieboldii. Bioorg Med Chem Lett 22:2527-33 (2012)  
Target
Name:
Peroxisome proliferator-activated receptor alpha
Synonyms:
NR1C1 PPAR PPAR-alpha PPARA_HUMAN Peroxisome proliferator-activated receptor | Peroxisome proliferator-activated receptor alpha (PPAR alpha)
Type:
Enzyme
Mol. Mass.:
52222.08
Organism:
Homo sapiens (Human)
Description:
Q07869
Residue:
468
  
Inhibitor
Name:
BDBM50379791
Synonyms:
METHYLEUGENOL | Methyl eugenol (1)
Type:
Small organic molecule
Emp. Form.:
C11H14O2
Mol. Mass.:
178.2277
SMILES:
COc1ccc(CC=C)cc1OC
: