Target
Heat shock protein HSP 90-beta
Ligand
BDBM50379843
Substrate
Meas. Tech.
ChEMBL_809742 (CHEMBL2016161)
IC50
1898±n/a nM
Citation
 Huang, KHBarta, TERice, JWSmith, EDOmmen, AJMa, WVeal, JMFadden, RPBarabasz, AFFoley, BEHughes, PFHanson, GJMarkworth, CJSilinski, MPartridge, JMSteed, PMHall, SE Discovery of novel aminoquinazolin-7-yl 6,7-dihydro-indol-4-ones as potent, selective inhibitors of heat shock protein 90. Bioorg Med Chem Lett 22:2550-4 (2012)  
Target
Name:
Heat shock protein HSP 90-beta
Synonyms:
HS90B_HUMAN HSP 90 HSP90B HSPCB Heat shock protein HSP 90 (Hsp90)
Type:
Molecular Chaperone
Mol. Mass.:
83229.45
Organism:
Homo sapiens (Human)
Description:
P08238
Residue:
724
  
Inhibitor
Name:
BDBM50379843
Synonyms:
CHEMBL2011846
Type:
Small organic molecule
Emp. Form.:
C19H21N5O
Mol. Mass.:
335.4029
SMILES:
Cc1cn(c2CC(C)(C)CC(=O)c12)-c1ccc2c(N)nc(N)nc2c1
: