Target
Dual specificity mitogen-activated protein kinase kinase 1
Ligand
BDBM50380080
Substrate
Meas. Tech.
ChEMBL_810785 (CHEMBL2016104)
IC50
36±n/a nM
Citation
 Adams, MEWallace, MBKanouni, TScorah, NO'Connell, SMMiyake, HShi, LHalkowycz, PZhang, LDong, Q Design and synthesis of orally available MEK inhibitors with potent in vivo antitumor efficacy. Bioorg Med Chem Lett 22:2411-4 (2012)  
Target
Name:
Dual specificity mitogen-activated protein kinase kinase 1
Synonyms:
Dual specificity mitogen-activated protein kinase (MEK) Dual specificity mitogen-activated protein kinase kinase 1 (MEK1) Dual specificity mitogen-activated protein kinase kinase MEK1/2 MAP kinase kinase 1 MAPK/ERK kinase 1 MEK-1 MP2K1_HUMAN PRKMK1 | VHL-MAP2K1/MAP2K2
Type:
Other Protein Type
Mol. Mass.:
43439.03
Organism:
Homo sapiens (Human)
Description:
Full-length human MEK-1 was generated by PCR and purified as a fusion protein from Escherichia coli lysates.
Residue:
393
  
Inhibitor
Name:
BDBM50380080
Synonyms:
CHEMBL2012901
Type:
Small organic molecule
Emp. Form.:
C19H18FN3O4
Mol. Mass.:
371.3623
SMILES:
Cn1c(Nc2ccc(cc2F)C#C)c(C(=O)NOCCO)c2CCC(=O)c12
: