Target
Cytochrome P450 1A1
Ligand
BDBM50380104
Substrate
Meas. Tech.
ChEMBL_811205 (CHEMBL2015040)
IC50
10.4±n/a nM
Citation
 El Massry, AMAsal, AMKhattab, SNHaiba, NSAwney, HAHelmy, MLanger, VAmer, A Synthesis and structure elucidation of novel fused 1,2,4-triazine derivatives as potent inhibitors targeting CYP1A1 activity. Bioorg Med Chem 20:2624-37 (2012)  
Target
Name:
Cytochrome P450 1A1
Synonyms:
CP1A1_RAT Cyp1a1
Type:
PROTEIN
Mol. Mass.:
59401.56
Organism:
Rattus norvegicus
Description:
ChEMBL_774160
Residue:
524
  
Inhibitor
Name:
BDBM50380104
Synonyms:
CHEMBL2013094
Type:
Small organic molecule
Emp. Form.:
C26H28N6O5
Mol. Mass.:
504.5377
SMILES:
COc1ccc(CC2=NN3C(=NN(C(C)=O)C3(C)c3ccc(C)cc3)N(N(C(C)=O)C(C)=O)C2=O)cc1
: