Target
Cytochrome P450 1A1
Ligand
BDBM50380110
Substrate
Meas. Tech.
ChEMBL_811205 (CHEMBL2015040)
IC50
5.53±n/a nM
Citation
 El Massry, AMAsal, AMKhattab, SNHaiba, NSAwney, HAHelmy, MLanger, VAmer, A Synthesis and structure elucidation of novel fused 1,2,4-triazine derivatives as potent inhibitors targeting CYP1A1 activity. Bioorg Med Chem 20:2624-37 (2012)  
Target
Name:
Cytochrome P450 1A1
Synonyms:
CP1A1_RAT Cyp1a1
Type:
PROTEIN
Mol. Mass.:
59401.56
Organism:
Rattus norvegicus
Description:
ChEMBL_774160
Residue:
524
  
Inhibitor
Name:
BDBM50380110
Synonyms:
CHEMBL2013100
Type:
Small organic molecule
Emp. Form.:
C19H17N7O3
Mol. Mass.:
391.3834
SMILES:
COc1ccc(Cc2nnc(NN=C3C(=O)Nc4ccccc34)n(N)c2=O)cc1
: