Target
Carbonic anhydrase 1
Ligand
BDBM50380141
Substrate
Meas. Tech.
ChEMBL_811721 (CHEMBL2014296)
Kd
1400±n/a nM
Citation
 Capkauskaite, EZubriene, ABaranauskiene, LTamulaitiene, GManakova, EKairys, VGražulis, STumkevicius, SMatulis, D Design of [(2-pyrimidinylthio)acetyl]benzenesulfonamides as inhibitors of human carbonic anhydrases. Eur J Med Chem 51:259-70 (2012)  
Target
Name:
Carbonic anhydrase 1
Synonyms:
CA-I CAB Carbonate dehydratase I Carbonic anhydrase 1 (CA I) Carbonic anhydrase 1 (Recombinant CA I) Carbonic anhydrase B Carbonic anhydrase I (CA I) Carbonic anhydrase I (CAI) Carbonic anhydrase isoenzyme I (hCA I) | hCA
Type:
Enzyme
Mol. Mass.:
28873.37
Organism:
Homo sapiens (Human)
Description:
P00915
Residue:
261
  
Inhibitor
Name:
BDBM50380141
Synonyms:
CHEMBL2010807
Type:
Small organic molecule
Emp. Form.:
C16H18ClN3O3S2
Mol. Mass.:
399.915
SMILES:
CCCCc1cnc(SCC(=O)c2ccc(Cl)c(c2)S(N)(=O)=O)nc1
: