Target
Carbonic anhydrase 7
Ligand
BDBM50380139
Substrate
Meas. Tech.
ChEMBL_811726 (CHEMBL2014301)
Kd
310±n/a nM
Citation
 Capkauskaite, EZubriene, ABaranauskiene, LTamulaitiene, GManakova, EKairys, VGražulis, STumkevicius, SMatulis, D Design of [(2-pyrimidinylthio)acetyl]benzenesulfonamides as inhibitors of human carbonic anhydrases. Eur J Med Chem 51:259-70 (2012)  
Target
Name:
Carbonic anhydrase 7
Synonyms:
CA-VII CAH7_HUMAN Carbonic anhydrase Carbonic anhydrase VII (CA VII)
Type:
Enzyme
Mol. Mass.:
29664.11
Organism:
Homo sapiens (Human)
Description:
Human cloned isozyme.
Residue:
264
  
Inhibitor
Name:
BDBM50380139
Synonyms:
CHEMBL2011157
Type:
Small organic molecule
Emp. Form.:
C14H12ClNO3S2
Mol. Mass.:
341.833
SMILES:
NS(=O)(=O)c1cc(ccc1Cl)C(=O)CSc1ccccc1
: