Target
Aromatase
Ligand
BDBM50380171
Substrate
Meas. Tech.
ChEMBL_811754 (CHEMBL2014375)
IC50
99000±n/a nM
Citation
 Bonfield, KAmato, EBankemper, TAgard, HSteller, JKeeler, JMRoy, DMcCallum, APaula, SMa, L Development of a new class of aromatase inhibitors: design, synthesis and inhibitory activity of 3-phenylchroman-4-one (isoflavanone) derivatives. Bioorg Med Chem 20:2603-13 (2012)  
Target
Name:
Aromatase
Synonyms:
ARO1 CP19A_HUMAN CYP19 CYPXIX Cytochrome P450 19A1 Cytochrome P450-C19 (CYP19) FL cytokine receptor precursor | P-450AROM
Type:
Enzyme
Mol. Mass.:
57888.92
Organism:
Homo sapiens (Human)
Description:
P11511
Residue:
503
  
Inhibitor
Name:
BDBM50380171
Synonyms:
CHEMBL2011182
Type:
Small organic molecule
Emp. Form.:
C16H14O3
Mol. Mass.:
254.2806
SMILES:
COc1cccc(c1)C1COc2ccccc2C1=O
: