Target
5'-AMP-activated protein kinase catalytic subunit alpha-1
Ligand
BDBM50380246
Substrate
Meas. Tech.
ChEMBL_813550 (CHEMBL2019659)
IC50
>40000±n/a nM
Citation
 Maryanoff, BEMcComsey, DFYabut, SCLuci, DKJordan, ADMasucci, JAJones, WJAbad, MCGibbs, ACPetrounia, I Inhibitors of Ketohexokinase: Discovery of Pyrimidinopyrimidines with Specific Substitution that Complements the ATP-Binding Site. ACS Med Chem Lett 2:538-543 (2011)  
Target
Name:
5'-AMP-activated protein kinase catalytic subunit alpha-1
Synonyms:
AAPK1_HUMAN AMP-activated protein kinase alpha-1/beta-2/gamma-2 AMPK subunit alpha-1 AMPK1 PRKAA1 | Tau-protein kinase PRKAA1
Type:
Protein
Mol. Mass.:
64023.62
Organism:
Homo sapiens (Human)
Description:
Q13131
Residue:
559
  
Inhibitor
Name:
BDBM50380246
Synonyms:
CHEMBL2017214
Type:
Small organic molecule
Emp. Form.:
C21H26N8S
Mol. Mass.:
422.55
SMILES:
CSc1ccccc1Nc1nc(nc2c(NCC3CC3)ncnc12)N1CCNCC1
: