Target
5'-AMP-activated protein kinase subunit beta-1
Ligand
BDBM50380246
Substrate
Meas. Tech.
ChEMBL_813551 (CHEMBL2019660)
IC50
>40000±n/a nM
Citation
 Maryanoff, BEMcComsey, DFYabut, SCLuci, DKJordan, ADMasucci, JAJones, WJAbad, MCGibbs, ACPetrounia, I Inhibitors of Ketohexokinase: Discovery of Pyrimidinopyrimidines with Specific Substitution that Complements the ATP-Binding Site. ACS Med Chem Lett 2:538-543 (2011)  
Target
Name:
5'-AMP-activated protein kinase subunit beta-1
Synonyms:
5'-AMP-activated protein kinase subunit beta-1 AMP-activated protein kinase alpha-2/beta-1/gamma-3 AMPK subunit beta-1 PRKAB1
Type:
Mol. Mass.:
30380.94
Organism:
Homo sapiens (Human)
Description:
Q9Y478
Residue:
270
  
Inhibitor
Name:
BDBM50380246
Synonyms:
CHEMBL2017214
Type:
Small organic molecule
Emp. Form.:
C21H26N8S
Mol. Mass.:
422.55
SMILES:
CSc1ccccc1Nc1nc(nc2c(NCC3CC3)ncnc12)N1CCNCC1
: