Target
Serine/threonine-protein kinase 3
Ligand
BDBM50362169
Substrate
Meas. Tech.
ChEMBL_813709 (CHEMBL2019911)
IC50
>30000±n/a nM
Citation
 Huang, XShipps, GWCheng, CCSpacciapoli, PZhang, XMcCoy, MAWyss, DFYang, XAchab, ASoucy, KMontavon, DKMurphy, DMWhitehurst, CE Discovery and Hit-to-Lead Optimization of Non-ATP Competitive MK2 (MAPKAPK2) Inhibitors. ACS Med Chem Lett 2:632-637 (2011)  
Target
Name:
Serine/threonine-protein kinase 3
Synonyms:
KRS1 MST2 STE20-Like Kinase MST2 STK3_HUMAN Serine/threonine-protein kinase 3 (MST2) Serine/threonine-protein kinase Krs-1 | Serine/threonine-protein kinase MST2
Type:
Serine/threonine-protein kinase
Mol. Mass.:
56284.87
Organism:
Homo sapiens (Human)
Description:
Residue:
491
  
Inhibitor
Name:
BDBM50362169
Synonyms:
CHEMBL1938680
Type:
Small organic molecule
Emp. Form.:
C21H20ClN3O2
Mol. Mass.:
381.855
SMILES:
Clc1ccc(cc1)-c1ccc(o1)C(=O)Nc1ccc(cc1)N1CCNCC1
: