Target
Galactokinase
Ligand
BDBM50380332
Substrate
Meas. Tech.
ChEMBL_813856 (CHEMBL2020225)
IC50
>50000±n/a nM
Citation
 Odejinmi, SRascon, RTang, MVankayalapati, HLai, K Structure-activity analysis and cell-based optimization of human galactokinase inhibitors. ACS Med Chem Lett 2:667-672 (2011)  
Target
Name:
Galactokinase
Synonyms:
GALK GALK1_HUMAN Galactokinase (GALK) | Galactose kinase
Type:
Enzyme
Mol. Mass.:
42271.26
Organism:
Homo sapiens (Human)
Description:
P51570
Residue:
392
  
Inhibitor
Name:
BDBM50380332
Synonyms:
CHEMBL2017793
Type:
Small organic molecule
Emp. Form.:
C18H14N2O2S2
Mol. Mass.:
354.446
SMILES:
Oc1cccc(c1)C1NC(=O)C(C#N)=C(SCc2ccccc2)S1
: