Target
Nucleotide-binding oligomerization domain-containing protein 2
Ligand
BDBM62251
Substrate
Meas. Tech.
ChEMBL_812916 (CHEMBL2020291)
IC50
200±n/a nM
Citation
 Khan, PMCorrea, RGDivlianska, DBPeddibhotla, SSessions, EHMagnuson, GBrown, BSuyama, EYuan, HMangravita-Novo, AVicchiarelli, MSu, YVasile, SSmith, LHDiaz, PWReed, JCRoth, GP Identification of Inhibitors of NOD1-Induced Nuclear Factor-żB Activation. ACS Med Chem Lett 2:780-785 (2011)  
Target
Name:
Nucleotide-binding oligomerization domain-containing protein 2
Synonyms:
CARD15 IBD1 NOD2 Nucleotide-binding oligomerization domain-containing protein 2 | nucleotide-binding oligomerization domain containing 2
Type:
PROTEIN
Mol. Mass.:
115287.18
Organism:
Homo sapiens (Human)
Description:
ChEMBL_1454053
Residue:
1040
  
Inhibitor
Name:
BDBM62251
Synonyms:
MLS-0412140.0001 cyclopropyl-[2-methyl-5-[4-(4-nitrophenyl)piperazin-1-yl]sulfonyl-2,3-dihydroindol-1-yl]methanone cyclopropyl-[2-methyl-5-[[4-(4-nitrophenyl)-1-piperazinyl]sulfonyl]-2,3-dihydroindol-1-yl]methanone
Type:
Small organic molecule
Emp. Form.:
C23H26N4O5S
Mol. Mass.:
470.541
SMILES:
CC1Cc2cc(ccc2N1C(=O)C1CC1)S(=O)(=O)N1CCN(CC1)c1ccc(cc1)[N+]([O-])=O
: