Target
Nucleotide-binding oligomerization domain-containing protein 2
Ligand
BDBM62288
Substrate
Meas. Tech.
ChEMBL_812916 (CHEMBL2020291)
IC50
30±n/a nM
Citation
 Khan, PMCorrea, RGDivlianska, DBPeddibhotla, SSessions, EHMagnuson, GBrown, BSuyama, EYuan, HMangravita-Novo, AVicchiarelli, MSu, YVasile, SSmith, LHDiaz, PWReed, JCRoth, GP Identification of Inhibitors of NOD1-Induced Nuclear Factor-żB Activation. ACS Med Chem Lett 2:780-785 (2011)  
Target
Name:
Nucleotide-binding oligomerization domain-containing protein 2
Synonyms:
CARD15 IBD1 NOD2 Nucleotide-binding oligomerization domain-containing protein 2 | nucleotide-binding oligomerization domain containing 2
Type:
PROTEIN
Mol. Mass.:
115287.18
Organism:
Homo sapiens (Human)
Description:
ChEMBL_1454053
Residue:
1040
  
Inhibitor
Name:
BDBM62288
Synonyms:
4-(3,4-dihydro-1H-isoquinolin-2-ylmethyl)-N-[4-(trifluoromethoxy)phenyl]benzamide MLS-0412185.0001 | cid_44229055
Type:
Small organic molecule
Emp. Form.:
C24H21F3N2O2
Mol. Mass.:
426.4309
SMILES:
FC(F)(F)Oc1ccc(NC(=O)c2ccc(CN3CCc4ccccc4C3)cc2)cc1
: