Target
Histone deacetylase 1
Ligand
BDBM50380405
Substrate
Meas. Tech.
ChEMBL_812981 (CHEMBL2020395)
IC50
2070±n/a nM
Citation
 Kalin, JHButler, KVAkimova, THancock, WWKozikowski, AP Second-generation histone deacetylase 6 inhibitors enhance the immunosuppressive effects of Foxp3+ T-regulatory cells. J Med Chem 55:639-51 (2012)  
Target
Name:
Histone deacetylase 1
Synonyms:
Cereblon/Histone deacetylase 1 HDAC1 Histone deacetylase 1 (HDAC1) RPD3L1
Type:
Enzyme
Mol. Mass.:
55090.27
Organism:
Homo sapiens (Human)
Description:
Q13547
Residue:
482
  
Inhibitor
Name:
BDBM50380405
Synonyms:
CHEMBL2018296
Type:
Small organic molecule
Emp. Form.:
C21H23N3O2
Mol. Mass.:
349.4262
SMILES:
CN1CCc2c(C1)c1cc(C)ccc1n2Cc1ccc(cc1)C(=O)NO
: