Target
Toll-like receptor 7
Ligand
BDBM50380491
Substrate
Meas. Tech.
ChEMBL_813078 (CHEMBL2020652)
IC50
560±n/a nM
Citation
 Shukla, NMMutz, CAMalladi, SSWarshakoon, HJBalakrishna, RDavid, SA Toll-like receptor (TLR)-7 and -8 modulatory activities of dimeric imidazoquinolines. J Med Chem 55:1106-16 (2012)  
Target
Name:
Toll-like receptor 7
Synonyms:
ORF Names:UNQ248/PRO285 TLR7_HUMAN | Toll-like receptor 7 (TLR7)
Type:
Enzyme
Mol. Mass.:
120945.35
Organism:
Homo sapiens (Human)
Description:
Q9NYK1
Residue:
1049
  
Inhibitor
Name:
BDBM50380491
Synonyms:
CHEMBL2018893
Type:
Small organic molecule
Emp. Form.:
C50H58N8
Mol. Mass.:
771.0491
SMILES:
CCCCc1nc2c(NCCCCCCCCNc3nc4ccccc4c4n(Cc5ccccc5)c(CCCC)nc34)nc3ccccc3c2n1Cc1ccccc1
: