Target
Cytochrome P450 2C8
Ligand
BDBM50380511
Substrate
Meas. Tech.
ChEMBL_813100 (CHEMBL2020719)
IC50
680±n/a nM
Citation
 Foti, RSRock, DAHan, XFlowers, RAWienkers, LCWahlstrom, JL Ligand-based design of a potent and selective inhibitor of cytochrome P450 2C19. J Med Chem 55:1205-14 (2012)  
Target
Name:
Cytochrome P450 2C8
Synonyms:
CP2C8_HUMAN CYPIIC8 P450 IIC2 P450 form 1 | S-mephenytoin 4-hydroxylase
Type:
Protein
Mol. Mass.:
55839.23
Organism:
Homo sapiens (Human)
Description:
P10632
Residue:
490
  
Inhibitor
Name:
BDBM50380511
Synonyms:
CHEMBL2018926
Type:
Small organic molecule
Emp. Form.:
C22H20N2O2S
Mol. Mass.:
376.471
SMILES:
COc1ccc2nc(SCc3ccc(OCc4ccccc4)cc3)[nH]c2c1
: