Target
Cytochrome P450 2E1
Ligand
BDBM50275735
Substrate
Meas. Tech.
ChEMBL_813104 (CHEMBL2020723)
IC50
50000±n/a nM
Citation
 Foti, RSRock, DAHan, XFlowers, RAWienkers, LCWahlstrom, JL Ligand-based design of a potent and selective inhibitor of cytochrome P450 2C19. J Med Chem 55:1205-14 (2012)  
Target
Name:
Cytochrome P450 2E1
Synonyms:
CP2E1_HUMAN CYP2E1 | Cytochrome P450 2E1 (CYP2E1)
Type:
Enzyme
Mol. Mass.:
56860.34
Organism:
Homo sapiens (Human)
Description:
P05181
Residue:
493
  
Inhibitor
Name:
BDBM50275735
Synonyms:
2-(3,5-dimethoxybenzylthio)-6-methoxy-1H-benzo[d]imidazole | CHEMBL488400
Type:
Small organic molecule
Emp. Form.:
C17H18N2O3S
Mol. Mass.:
330.401
SMILES:
COc1ccc2nc(SCc3cc(OC)cc(OC)c3)[nH]c2c1
: