Target
Cholinesterase
Ligand
BDBM50380536
Substrate
Meas. Tech.
ChEMBL_813112 (CHEMBL2020731)
IC50
0.25±n/a nM
Citation
 Fernández-Bachiller, MIPérez, CMonjas, LRademann, JRodríguez-Franco, MI New tacrine-4-oxo-4H-chromene hybrids as multifunctional agents for the treatment of Alzheimer's disease, with cholinergic, antioxidant, andß-amyloid-reducing properties. J Med Chem 55:1303-17 (2012)  
Target
Name:
Cholinesterase
Synonyms:
BCHE CHLE_HORSE | Cholinesterase
Type:
Enzyme
Mol. Mass.:
65643.35
Organism:
Equus caballus (Horse)
Description:
P81908
Residue:
574
  
Inhibitor
Name:
BDBM50380536
Synonyms:
CHEMBL2019031
Type:
Small organic molecule
Emp. Form.:
C35H43N3O3
Mol. Mass.:
553.7342
SMILES:
O=C(NCCCCCCCCCCCCNc1c2CCCCc2nc2ccccc12)c1cc(=O)c2ccccc2o1
: