Target
Plasminogen
Ligand
BDBM50380623
Substrate
Meas. Tech.
ChEMBL_813172 (CHEMBL2020838)
Ki
1.1±n/a nM
Citation
 Saupe, SMSteinmetzer, T A new strategy for the development of highly potent and selective plasmin inhibitors. J Med Chem 55:1171-80 (2012)  
Target
Name:
Plasminogen
Synonyms:
Activation peptide PLG Plasmin Plasmin heavy chain A, short form | Plasmin light chain B
Type:
Enzyme
Mol. Mass.:
90579.18
Organism:
Homo sapiens (Human)
Description:
Residue:
810
  
Inhibitor
Name:
BDBM50380623
Synonyms:
CHEMBL2016870
Type:
Small organic molecule
Emp. Form.:
C45H47N7O6S
Mol. Mass.:
813.963
SMILES:
NC(=N)c1ccc(CNC(=O)[C@@H]2Cc3cccc(CNC(=O)Cc4cccc(CC(=O)NCc5cccc(C[C@@H](NS(=O)(=O)Cc6ccccc6)C(=O)N2)c5)c4)c3)cc1
: