Target
Cannabinoid receptor 2
Ligand
BDBM50380719
Substrate
Meas. Tech.
ChEMBL_813335 (CHEMBL2019456)
Ki
19.95±n/a nM
Citation
 Adam, JMClark, JKDavies, KEverett, KFields, RFrancis, SJeremiah, FKiyoi, TMaidment, MMorrison, ARatcliffe, PProsser, ASchulz, JWishart, GBaker, JBoyce, SCampbell, RCottney, JEDeehan, MMartin, I Low brain penetrant CB1 receptor agonists for the treatment of neuropathic pain. Bioorg Med Chem Lett 22:2932-7 (2012)  
Target
Name:
Cannabinoid receptor 2
Synonyms:
CANNABINOID CB2 CB2 CB2B CNR2_HUMAN Cannabinoid CB2 receptor Cannabinoid receptor 2 (CB2R) | hCB2
Type:
G Protein-Coupled Receptor (GPCR)
Mol. Mass.:
39690.94
Organism:
Homo sapiens (Human)
Description:
P34972
Residue:
360
  
Inhibitor
Name:
BDBM50380719
Synonyms:
CHEMBL1682275
Type:
Small organic molecule
Emp. Form.:
C25H32ClN5O4
Mol. Mass.:
502.006
SMILES:
OCCNC(=O)C1CCN(Cc2nc(no2)-c2cn(CC3CCOCC3)c3c(Cl)cccc23)CC1
: