Target
Tyrosine-protein phosphatase non-receptor type 1
Ligand
BDBM50380743
Substrate
Meas. Tech.
ChEMBL_813440 (CHEMBL2019336)
Ki
7700±n/a nM
Citation
 Basu, SPrasad, UVBarawkar, DADe, SPalle, VPMenon, SPatel, MThorat, SSingh, UPDas Sarma, KWaman, YNiranjan, SPathade, VGaur, AReddy, SAnsari, S Discovery of novel and potent heterocyclic carboxylic acid derivatives as protein tyrosine phosphatase 1B inhibitors. Bioorg Med Chem Lett 22:2843-9 (2012)  
Target
Name:
Tyrosine-protein phosphatase non-receptor type 1
Synonyms:
PTN1_HUMAN PTPN1 Protein tyrosine phosphatase-1B (PTP1B) Protein-tyrosine phosphatase 1B (PTP1B) Tyrosine-protein phosphatase non-receptor type 1 (PTP1B)
Type:
Protein phosphatase
Mol. Mass.:
49963.76
Organism:
Homo sapiens (Human)
Description:
Human recombinant GST-fusion PTP1B (1-435).
Residue:
435
  
Inhibitor
Name:
BDBM50380743
Synonyms:
CHEMBL2017842
Type:
Small organic molecule
Emp. Form.:
C26H23NO4
Mol. Mass.:
413.4651
SMILES:
OC(=O)C1CN(C(=O)C1)c1ccc(CC(C(=O)c2ccccc2)c2ccccc2)cc1
: