Target
Tyrosine-protein phosphatase non-receptor type 1
Ligand
BDBM50380756
Substrate
Meas. Tech.
ChEMBL_813440 (CHEMBL2019336)
Ki
500±n/a nM
Citation
 Basu, SPrasad, UVBarawkar, DADe, SPalle, VPMenon, SPatel, MThorat, SSingh, UPDas Sarma, KWaman, YNiranjan, SPathade, VGaur, AReddy, SAnsari, S Discovery of novel and potent heterocyclic carboxylic acid derivatives as protein tyrosine phosphatase 1B inhibitors. Bioorg Med Chem Lett 22:2843-9 (2012)  
Target
Name:
Tyrosine-protein phosphatase non-receptor type 1
Synonyms:
PTN1_HUMAN PTPN1 Protein tyrosine phosphatase-1B (PTP1B) Protein-tyrosine phosphatase 1B (PTP1B) Tyrosine-protein phosphatase non-receptor type 1 (PTP1B)
Type:
Protein phosphatase
Mol. Mass.:
49963.76
Organism:
Homo sapiens (Human)
Description:
Human recombinant GST-fusion PTP1B (1-435).
Residue:
435
  
Inhibitor
Name:
BDBM50380756
Synonyms:
CHEMBL2017855
Type:
Small organic molecule
Emp. Form.:
C27H20FN3O4S
Mol. Mass.:
501.529
SMILES:
COc1ccc(cc1)C(Cc1ccc(cc1)-c1nc(cs1)C(O)=O)c1nc(no1)-c1cccc(F)c1
: