Target
Tyrosine-protein kinase receptor TYRO3
Ligand
BDBM50380798
Substrate
Meas. Tech.
ChEMBL_813619 (CHEMBL2019768)
IC50
60±n/a nM
Citation
 Forns, PEsteve, CTaboada, LAlonso, JAOrellana, AMaldonado, MCarreño, CRamis, ILópez, MMiralpeix, MVidal, B Pyrazine-based Syk kinase inhibitors. Bioorg Med Chem Lett 22:2784-8 (2012)  
Target
Name:
Tyrosine-protein kinase receptor TYRO3
Synonyms:
BYK RSE TIF TYRO3_HUMAN | Tyrosine-protein kinase SKY
Type:
Protein
Mol. Mass.:
96894.13
Organism:
Homo sapiens (Human)
Description:
Q06418
Residue:
890
  
Inhibitor
Name:
BDBM50380798
Synonyms:
CHEMBL2018031
Type:
Small organic molecule
Emp. Form.:
C26H28N6O4
Mol. Mass.:
488.5383
SMILES:
Nc1ncc(nc1C(=O)N[C@H]1C2CC3CC1C[C@@](O)(C3)C2)-c1cccc(c1)-c1cnn(CC(O)=O)c1
: