Target
Vascular endothelial growth factor receptor 2
Ligand
BDBM5328
Substrate
Meas. Tech.
ChEMBL_814095 (CHEMBL2020689)
IC50
8±n/a nM
Citation
 Han, SYChoi, JWYang, JChae, CHLee, JJung, HLee, KHa, JDKim, HRCho, SY Design and synthesis of 3-(4,5,6,7-tetrahydro-3H-imidazo[4,5-c]pyridin-2-yl)-1H-quinolin-2-ones as VEGFR-2 kinase inhibitors. Bioorg Med Chem Lett 22:2837-42 (2012)  
Target
Name:
Vascular endothelial growth factor receptor 2
Synonyms:
CD_antigen=CD309 Fetal liver kinase 1 (FLK-1) KDR Protein-tyrosine kinase receptor Flk-1 VEGFR-2 VEGFR2 Vascular Endothelial Growth Factor Receptor Kinase 2 Vascular endothelial growth factor receptor 2 (KDR) Vascular endothelial growth factor receptor 2 (VEGFR2) Vascular endothelial growth factor receptor-2 (VEGFR-2)
Type:
Receptor Tyrosine Kinase
Mol. Mass.:
151510.97
Organism:
Homo sapiens (Human)
Description:
P35968
Residue:
1356
  
Inhibitor
Name:
BDBM5328
Synonyms:
2-quinolinone deriv. 3 CHEMBL221736
Type:
Small organic molecule
Emp. Form.:
C17H12N2O
Mol. Mass.:
260.29
SMILES:
O=c1[nH]c2ccccc2cc1-c1cc2ccccc2[nH]1
: