Target
Ectonucleotide pyrophosphatase/phosphodiesterase family member 2
Ligand
BDBM50381022
Substrate
Meas. Tech.
ChEMBL_814121 (CHEMBL2020715)
IC50
2418±n/a nM
Citation
 Gendaszewska-Darmach, ELaska, ERytczak, POkruszek, A The chemical synthesis of metabolically stabilized 2-OMe-LPA analogues and preliminary studies of their inhibitory activity toward autotaxin. Bioorg Med Chem Lett 22:2698-700 (2012)  
Target
Name:
Ectonucleotide pyrophosphatase/phosphodiesterase family member 2
Synonyms:
ATX Autotaxin (ATX) ENPP2 Ectonucleotide Pyrophosphatase/Phosphodiesterase 2 (ENPP2) Extracellular lysophospholipase D PDNP2
Type:
Enzyme
Mol. Mass.:
99007.13
Organism:
Homo sapiens (Human)
Description:
Q13822
Residue:
863
  
Inhibitor
Name:
BDBM50381022
Synonyms:
CHEMBL2017139
Type:
Small organic molecule
Emp. Form.:
C22H45O6PS
Mol. Mass.:
468.628
SMILES:
CCCCCCCCCCCCCCCCCC(=O)OCC(COP(O)(S)=O)OC
: