Target
Mu-type opioid receptor
Ligand
BDBM50381027
Substrate
Meas. Tech.
ChEMBL_814124 (CHEMBL2020765)
Ki
35±n/a nM
Citation
 Nagase, HAkiyama, JNakajima, RHirayama, SNemoto, TGouda, HHirono, SFujii, H Synthesis of new opioid derivatives with a propellane skeleton and their pharmacology. Part 2: Propellane derivatives with an amide side chain. Bioorg Med Chem Lett 22:2775-9 (2012)  
Target
Name:
Mu-type opioid receptor
Synonyms:
M-OR-1 Mor OPRM_MOUSE Oprm | Oprm1
Type:
Enzyme Catalytic Domain
Mol. Mass.:
44431.62
Organism:
MOUSE
Description:
OPIATE Mu OPRM1 MOUSE::P42866
Residue:
398
  
Inhibitor
Name:
BDBM50381027
Synonyms:
CHEMBL2017142
Type:
Small organic molecule
Emp. Form.:
C28H34N2O3
Mol. Mass.:
446.5812
SMILES:
CN([C@H]1CCC23Cc4ccc(O)cc4C2(CCN(CC2CC2)C3)C1)C(=O)\C=C\c1ccoc1
: