Target
Serine/threonine-protein kinase pim-1
Ligand
BDBM50381040
Substrate
Meas. Tech.
ChEMBL_814129 (CHEMBL2020770)
IC50
2±n/a nM
Citation
 Pierre, FRegan, CFChevrel, MCSiddiqui-Jain, AMacalino, DStreiner, NDrygin, DHaddach, MO'Brien, SERice, WGRyckman, DM Novel potent dual inhibitors of CK2 and Pim kinases with antiproliferative activity against cancer cells. Bioorg Med Chem Lett 22:3327-31 (2012)  
Target
Name:
Serine/threonine-protein kinase pim-1
Synonyms:
PIM-1 Kinase PIM1_HUMAN Serine/threonine-protein kinase (PIM1) Serine/threonine-protein kinase PIM1 | Serine/threonine-protein kinase pim-1 (PIM1)
Type:
Protein
Mol. Mass.:
35681.82
Organism:
Homo sapiens (Human)
Description:
P11309
Residue:
313
  
Inhibitor
Name:
BDBM50381040
Synonyms:
CHEMBL2017348
Type:
Small organic molecule
Emp. Form.:
C19H11F2N5S
Mol. Mass.:
379.386
SMILES:
Fc1ccc(Nc2nc3c(cccc3c3sccc23)-c2nnc[nH]2)c(F)c1
: