Target
Tyrosine-protein kinase ITK/TSK
Ligand
BDBM50381096
Substrate
Meas. Tech.
ChEMBL_814173 (CHEMBL2020887)
IC50
0.3±n/a nM
Citation
 McLean, LRZhang, YZaidi, NBi, XWang, RDharanipragada, RJurcak, JGGillespy, TAZhao, ZMusick, KYChoi, YMBarrague, MPeppard, JSmicker, MDuguid, MParkar, AFordham, JKominos, D X-ray crystallographic structure-based design of selective thienopyrazole inhibitors for interleukin-2-inducible tyrosine kinase. Bioorg Med Chem Lett 22:3296-300 (2012)  
Target
Name:
Tyrosine-protein kinase ITK/TSK
Synonyms:
EMT ITK_HUMAN LYK Tyrosine-protein kinase ITK Tyrosine-protein kinase Lyk
Type:
Protein
Mol. Mass.:
71839.20
Organism:
Homo sapiens (Human)
Description:
Q08881
Residue:
620
  
Inhibitor
Name:
BDBM50381096
Synonyms:
CHEMBL2017556
Type:
Small organic molecule
Emp. Form.:
C19H19F2N3OS
Mol. Mass.:
375.435
SMILES:
CCC(O)(CC)c1ccc2cc([nH]c2c1)-c1n[nH]c2cc(sc12)C(F)F
: