Target
Tyrosine-protein kinase TXK
Ligand
BDBM50381097
Substrate
Meas. Tech.
ChEMBL_814176 (CHEMBL2020890)
IC50
440.9±n/a nM
Citation
 McLean, LRZhang, YZaidi, NBi, XWang, RDharanipragada, RJurcak, JGGillespy, TAZhao, ZMusick, KYChoi, YMBarrague, MPeppard, JSmicker, MDuguid, MParkar, AFordham, JKominos, D X-ray crystallographic structure-based design of selective thienopyrazole inhibitors for interleukin-2-inducible tyrosine kinase. Bioorg Med Chem Lett 22:3296-300 (2012)  
Target
Name:
Tyrosine-protein kinase TXK
Synonyms:
PTK4 RLK TXK Tyrosine-protein kinase TXK (TXK)
Type:
Protein
Mol. Mass.:
61268.80
Organism:
Homo sapiens (Human)
Description:
P42681
Residue:
527
  
Inhibitor
Name:
BDBM50381097
Synonyms:
CHEMBL2017557
Type:
Small organic molecule
Emp. Form.:
C24H23N3OS
Mol. Mass.:
401.524
SMILES:
CCC(O)(CC)c1ccc2cc([nH]c2c1)-c1n[nH]c2cc(sc12)-c1ccccc1
: