Target
Amine oxidase [flavin-containing] A
Ligand
BDBM50381226
Substrate
Meas. Tech.
ChEMBL_814309 (CHEMBL2019406)
IC50
18340±n/a nM
Citation
 Mu, LHWang, BRen, HYLiu, PGuo, DHWang, FMBai, LGuo, YS Synthesis and inhibitory effect of piperine derivates on monoamine oxidase. Bioorg Med Chem Lett 22:3343-8 (2012)  
Target
Name:
Amine oxidase [flavin-containing] A
Synonyms:
AOFA_RAT Amine oxidase [flavin-containing] A Monoamine Oxidase Type A (MAO-A) Monoamine oxidase A (MAO-A) Monoamine oxidase type A (MAOA)
Type:
Enzyme
Mol. Mass.:
59515.21
Organism:
Rattus norvegicus (rat)
Description:
Residue:
526
  
Inhibitor
Name:
BDBM50381226
Synonyms:
PIPERIC ACID
Type:
Small organic molecule
Emp. Form.:
C12H10O4
Mol. Mass.:
218.2054
SMILES:
OC(=O)\C=C\C=C\c1ccc2OCOc2c1
: