Target
Carbonic anhydrase 12
Ligand
BDBM26664
Substrate
Meas. Tech.
ChEMBL_814446 (CHEMBL2019842)
Ki
8400±n/a nM
Citation
 Balboni, GCongiu, COnnis, VMaresca, AScozzafava, AWinum, JYMaietti, ASupuran, CT Flavones and structurally related 4-chromenones inhibit carbonic anhydrases by a different mechanism of action compared to coumarins. Bioorg Med Chem Lett 22:3063-6 (2012)  
Target
Name:
Carbonic anhydrase 12
Synonyms:
CA-XII CAH12_HUMAN Carbonic anhydrase Carbonic anhydrase XII Carbonic anhydrase XII (CAXII) | Tumor antigen HOM-RCC-3.1.3
Type:
Enzyme
Mol. Mass.:
39456.00
Organism:
Homo sapiens (Human)
Description:
Catalytic domain of human cloned isozyme was used in the assay
Residue:
354
  
Inhibitor
Name:
BDBM26664
Synonyms:
7-Hydroxy-flavone, 5a 7-hydroxy-2-phenyl-4H-chromen-4-one CHEMBL276915
Type:
Flavonoid
Emp. Form.:
C15H10O3
Mol. Mass.:
238.2381
SMILES:
Oc1ccc2c(c1)oc(cc2=O)-c1ccccc1
: