Target
Melanin-concentrating hormone receptor 1
Ligand
BDBM50381517
Substrate
Meas. Tech.
ChEMBL_814588 (CHEMBL2021107)
IC50
4±n/a nM
Citation
 Sasmal, SBalasubrahmanyam, DKanna Reddy, HRBalaji, GSrinivas, GCheera, SAbbineni, CSasmal, PKKhanna, ISebastian, VJJadhav, VPSingh, MPTalwar, RSuresh, JShashikumar, DHarinder Reddy, KSihorkar, VFrimurer, TMRist, ØElster, LHögberg, T Design and optimization of quinazoline derivatives as melanin concentrating hormone receptor 1 (MCHR1) antagonists: part 2. Bioorg Med Chem Lett 22:3163-7 (2012)  
Target
Name:
Melanin-concentrating hormone receptor 1
Synonyms:
G-protein coupled receptor 24 MCH receptor 1 MCH-R1 MCHR-1 MCHR1_HUMAN Melanin-Concentrating Hormone Receptor 1 (MCH1R) Melanin-concentrating hormone receptor 1 (MCH-1) Melanin-concentrating hormone receptor 1 (MCHR-1) SLC-1 Somatostatin receptor-like protein
Type:
G Protein-Coupled Receptor (GPCR)
Mol. Mass.:
45976.27
Organism:
Homo sapiens (Human)
Description:
Membranes from CHO-K1 cells stably expressing human MCH1R were used in assays.
Residue:
422
  
Inhibitor
Name:
BDBM50381517
Synonyms:
CHEMBL2017748
Type:
Small organic molecule
Emp. Form.:
C27H28F3N5O4S
Mol. Mass.:
575.603
SMILES:
Cc1nc(nc2ccc(NC(=O)\C=C\c3ccc(OC(F)(F)F)cc3)cc12)N1CCC(CC1)N1CCCS1(=O)=O
: