Target
Melanin-concentrating hormone receptor 1
Ligand
BDBM50381482
Substrate
Meas. Tech.
ChEMBL_814589 (CHEMBL2021108)
IC50
227±n/a nM
Citation
 Sasmal, SBalasubrahmanyam, DKanna Reddy, HRBalaji, GSrinivas, GCheera, SAbbineni, CSasmal, PKKhanna, ISebastian, VJJadhav, VPSingh, MPTalwar, RSuresh, JShashikumar, DHarinder Reddy, KSihorkar, VFrimurer, TMRist, ØElster, LHögberg, T Design and optimization of quinazoline derivatives as melanin concentrating hormone receptor 1 (MCHR1) antagonists: part 2. Bioorg Med Chem Lett 22:3163-7 (2012)  
Target
Name:
Melanin-concentrating hormone receptor 1
Synonyms:
G-protein coupled receptor 24 MCH receptor 1 MCH-R1 MCHR-1 MCHR1_HUMAN Melanin-Concentrating Hormone Receptor 1 (MCH1R) Melanin-concentrating hormone receptor 1 (MCH-1) Melanin-concentrating hormone receptor 1 (MCHR-1) SLC-1 Somatostatin receptor-like protein
Type:
G Protein-Coupled Receptor (GPCR)
Mol. Mass.:
45976.27
Organism:
Homo sapiens (Human)
Description:
Membranes from CHO-K1 cells stably expressing human MCH1R were used in assays.
Residue:
422
  
Inhibitor
Name:
BDBM50381482
Synonyms:
CHEMBL2017590
Type:
Small organic molecule
Emp. Form.:
C24H25ClN4O2
Mol. Mass.:
436.934
SMILES:
C\C(=C/C(=O)Nc1ccc2nc(nc(C)c2c1)N1CCC(O)CC1)c1ccc(Cl)cc1
: