Target
17-beta-hydroxysteroid dehydrogenase type 3
Ligand
BDBM50381559
Substrate
Meas. Tech.
ChEMBL_814690 (CHEMBL2021209)
IC50
5±n/a nM
Citation
 Harada, KKubo, HAbe, JHaneta, MConception, AInoue, SOkada, SNishioka, K Discovery of potent and orally bioavailable 17ß-hydroxysteroid dehydrogenase type 3 inhibitors. Bioorg Med Chem 20:3242-54 (2012)  
Target
Name:
17-beta-hydroxysteroid dehydrogenase type 3
Synonyms:
17-beta-hydroxysteroid dehydrogenase type 3 EDH17B3 HSD17B3 | SDR12C2
Type:
Enzyme
Mol. Mass.:
34525.39
Organism:
Homo sapiens (Human)
Description:
P37058
Residue:
310
  
Inhibitor
Name:
BDBM50381559
Synonyms:
CHEMBL2018253
Type:
Small organic molecule
Emp. Form.:
C17H11F2NO4S
Mol. Mass.:
363.335
SMILES:
COc1ccc(cc1)N1C(=S)O\C(=C/c2cc(F)c(O)c(F)c2)C1=O
: