Target
17-beta-hydroxysteroid dehydrogenase type 3
Ligand
BDBM50381589
Substrate
Meas. Tech.
ChEMBL_814690 (CHEMBL2021209)
IC50
20±n/a nM
Citation
 Harada, KKubo, HAbe, JHaneta, MConception, AInoue, SOkada, SNishioka, K Discovery of potent and orally bioavailable 17ß-hydroxysteroid dehydrogenase type 3 inhibitors. Bioorg Med Chem 20:3242-54 (2012)  
Target
Name:
17-beta-hydroxysteroid dehydrogenase type 3
Synonyms:
17-beta-hydroxysteroid dehydrogenase type 3 EDH17B3 HSD17B3 | SDR12C2
Type:
Enzyme
Mol. Mass.:
34525.39
Organism:
Homo sapiens (Human)
Description:
P37058
Residue:
310
  
Inhibitor
Name:
BDBM50381589
Synonyms:
CHEMBL2018241
Type:
Small organic molecule
Emp. Form.:
C15H8BrClN2O4
Mol. Mass.:
395.592
SMILES:
Oc1ccc(\C=C2/OC(=O)N(C2=O)c2ccc(Cl)nc2)cc1Br
: